Target
Monoglyceride lipase
Ligand
BDBM474403
Substrate
Meas. Tech.
MAGL Enzymatic Assay (0 minute)
IC50
3.09±n/a nM
Citation
 Brodney, MAButler, CRMcAllister, LAHelal, CJO''Neil, SVVerhoest, PR Heterocyclic spiro compounds as MAGL inhibitors US Patent  US10858373 Publication Date 12/8/2020 
Target
Name:
Monoglyceride lipase
Synonyms:
HU-K5 Lysophospholipase-like MGL MGLL_HUMAN
Type:
Hydrolase
Mol. Mass.:
33264.56
Organism:
Homo sapiens (Human)
Description:
Human recombinant MGL (Cayman Chemical, cat# 10008354).
Residue:
303
  
Inhibitor
Name:
BDBM474403
Synonyms:
1,1,1,3,3,3-Hexafluoropropan-2-yl 4-(phenylsulfonyl)-1-oxa-4,9-diazaspiro[5.5]undecane-9-carboxylate | US10858373, Example 1
Type:
Small organic molecule
Emp. Form.:
C18H20F6N2O5S
Mol. Mass.:
490.417
SMILES:
FC(F)(F)C(OC(=O)N1CCC2(CC1)CN(CCO2)S(=O)(=O)c1ccccc1)C(F)(F)F
: