Target
Monoglyceride lipase
Ligand
BDBM474414
Substrate
Meas. Tech.
MAGL Enzymatic Assay (30 minute)
IC50
4.90±n/a nM
Citation
 Brodney, MAButler, CRMcAllister, LAHelal, CJO''Neil, SVVerhoest, PR Heterocyclic spiro compounds as MAGL inhibitors US Patent  US10858373 Publication Date 12/8/2020 
Target
Name:
Monoglyceride lipase
Synonyms:
HU-K5 Lysophospholipase-like MGL MGLL_HUMAN
Type:
Hydrolase
Mol. Mass.:
33264.56
Organism:
Homo sapiens (Human)
Description:
Human recombinant MGL (Cayman Chemical, cat# 10008354).
Residue:
303
  
Inhibitor
Name:
BDBM474414
Synonyms:
1,1,1,3,3,3-Hexafluoropropan-2-yl (3R)-3-(4-fluoro-1H-pyrazol-1-yl)-1-oxa-8-azaspiro[4.5]decane-8-carboxylate | US10858373, Example 12
Type:
Small organic molecule
Emp. Form.:
C15H16F7N3O3
Mol. Mass.:
419.2947
SMILES:
Fc1cnn(c1)[C@H]1COC2(C1)CCN(CC2)C(=O)OC(C(F)(F)F)C(F)(F)F
: