Target
Monoglyceride lipase
Ligand
BDBM474451
Substrate
Meas. Tech.
MAGL Enzymatic Assay (0 minute)
IC50
8.34±n/a nM
Citation
 Brodney, MAButler, CRMcAllister, LAHelal, CJO''Neil, SVVerhoest, PR Heterocyclic spiro compounds as MAGL inhibitors US Patent  US10858373 Publication Date 12/8/2020 
Target
Name:
Monoglyceride lipase
Synonyms:
HU-K5 Lysophospholipase-like MGL MGLL_HUMAN
Type:
Hydrolase
Mol. Mass.:
33264.56
Organism:
Homo sapiens (Human)
Description:
Human recombinant MGL (Cayman Chemical, cat# 10008354).
Residue:
303
  
Inhibitor
Name:
BDBM474451
Synonyms:
US10858373, Example 49
Type:
Small organic molecule
Emp. Form.:
C19H18F9NO4
Mol. Mass.:
495.3361
SMILES:
FC(F)(F)Oc1cccc(c1)C1COC2(C1)CCN(CC2)C(=O)OC(C(F)(F)F)C(F)(F)F
: