Target
Monoglyceride lipase
Ligand
BDBM474455
Substrate
Meas. Tech.
MAGL Enzymatic Assay (30 minute)
IC50
10.1±n/a nM
Citation
 Brodney, MAButler, CRMcAllister, LAHelal, CJO''Neil, SVVerhoest, PR Heterocyclic spiro compounds as MAGL inhibitors US Patent  US10858373 Publication Date 12/8/2020 
Target
Name:
Monoglyceride lipase
Synonyms:
HU-K5 Lysophospholipase-like MGL MGLL_HUMAN
Type:
Hydrolase
Mol. Mass.:
33264.56
Organism:
Homo sapiens (Human)
Description:
Human recombinant MGL (Cayman Chemical, cat# 10008354).
Residue:
303
  
Inhibitor
Name:
BDBM474455
Synonyms:
US10858373, Example 53
Type:
Small organic molecule
Emp. Form.:
C19H21F2N3O5
Mol. Mass.:
409.3839
SMILES:
FC(F)c1ccc(OC2CC3(C2)CCN(CC3)C(=O)ON2C(=O)CCC2=O)cn1
: