Target
Ataxin-1
Ligand
BDBM475826
Substrate
Meas. Tech.
Enzyme Inhibition Assay
IC50
277±n/a nM
Citation
 Mattei, PHunziker, DDi Giorgio, PHert, JRudolph, MWang, L Octahydro-cyclobuta[1,2-c;3,4-c′]dipyrrol-2-yl US Patent  US10849881 Publication Date 12/1/2020 
Target
Name:
Ataxin-1
Synonyms:
ATX1 ATXN1 | SCA1
Type:
Protein
Mol. Mass.:
86941.25
Organism:
Homo sapiens (Human)
Description:
P54253
Residue:
815
  
Inhibitor
Name:
BDBM475826
Synonyms:
(1H-benzotriazol-5-yl)- {(3aS,3bS,6aR,6bR)-5-[6-(2,2,2-trifluoro- ethoxy)-pyridine-3-carbonyl]-octahydro- cyclobuta[1,2-c;3,4-c']dipyrrol-2-yl}- methanone | US10849881, Example 1.099
Type:
Small organic molecule
Emp. Form.:
C23H23F3N6O3
Mol. Mass.:
488.4623
SMILES:
FC(F)(F)COc1ccc(cn1)C(=O)N1C[C@H]2[C@@H](C1)[C@@H]1CN(C[C@H]21)C(=O)c1ccc2NNNc2c1
: