Target
Ataxin-1
Ligand
BDBM475829
Substrate
Meas. Tech.
Enzyme Inhibition Assay
IC50
992±n/a nM
Citation
 Mattei, PHunziker, DDi Giorgio, PHert, JRudolph, MWang, L Octahydro-cyclobuta[1,2-c;3,4-c′]dipyrrol-2-yl US Patent  US10849881 Publication Date 12/1/2020 
Target
Name:
Ataxin-1
Synonyms:
ATX1 ATXN1 | SCA1
Type:
Protein
Mol. Mass.:
86941.25
Organism:
Homo sapiens (Human)
Description:
P54253
Residue:
815
  
Inhibitor
Name:
BDBM475829
Synonyms:
US10849881, Example 1.102 | [(3aS,3bR,6aS,6bR)-5-(6- cyclopropylmethoxy-pyridazine-3- carbonyl)-octahydro-cyclobuta[1,2-c;3,4- c']dipyrrol-2-yl]-(3,4-dimethyl-phenyl)- methanone
Type:
Small organic molecule
Emp. Form.:
C24H27N7O3
Mol. Mass.:
461.5163
SMILES:
O=C(N1C[C@H]2[C@@H](C1)[C@@H]1CN(C[C@H]21)C(=O)c1ccc(OCC2CC2)nn1)c1ccc2NNNc2c1
: