Target
Ataxin-1
Ligand
BDBM475830
Substrate
Meas. Tech.
Enzyme Inhibition Assay
IC50
27.0±n/a nM
Citation
 Mattei, PHunziker, DDi Giorgio, PHert, JRudolph, MWang, L Octahydro-cyclobuta[1,2-c;3,4-c′]dipyrrol-2-yl US Patent  US10849881 Publication Date 12/1/2020 
Target
Name:
Ataxin-1
Synonyms:
ATX1 ATXN1 | SCA1
Type:
Protein
Mol. Mass.:
86941.25
Organism:
Homo sapiens (Human)
Description:
P54253
Residue:
815
  
Inhibitor
Name:
BDBM475830
Synonyms:
(1H-benzotriazol-yl)- {(3aS,3bS,6aR,6bR)-5-[5-bromo-2-methyl- 6-(2,2,2-trifluoro-ethoxy)-pyridine-3- carbonyl]-octahydro-cyclobuta[1,2-c;3,4- c']dipyrrol-2-yl}-methanone | US10849881, Example 1.103
Type:
Small organic molecule
Emp. Form.:
C24H24BrF3N6O3
Mol. Mass.:
581.385
SMILES:
Cc1nc(OCC(F)(F)F)c(Br)cc1C(=O)N1C[C@H]2[C@@H]3CN(C[C@@H]3[C@H]2C1)C(=O)c1ccc2NNNc2c1
: