Target
Complement factor D
Ligand
BDBM474692
Substrate
Meas. Tech.
Inhibition Assay
IC50
<1000±n/a nM
Citation
 Kotian, PLBabu, YSZhang, WVogeti, LWu, MChintareddy, VRRaman, K Benzopyrazole compounds and analogues thereof US Patent  US10849883 Publication Date 12/1/2020 
Target
Name:
Complement factor D
Synonyms:
Adipsin CFAD_HUMAN DF Properdin factor D
Type:
Protein
Mol. Mass.:
27039.19
Organism:
Homo sapiens (Human)
Description:
P00746
Residue:
253
  
Inhibitor
Name:
BDBM474692
Synonyms:
US10849883, Compound 118b | US11559515, Compound 118b
Type:
Small organic molecule
Emp. Form.:
C27H28BrN7O3
Mol. Mass.:
578.46
SMILES:
CC(C)N(CC(=O)NCc1cccc(Br)n1)C(=O)Cn1cc(C(C)=O)c2cc(Nc3cncnc3)ccc12
: