Target
Complement factor D
Ligand
BDBM474764
Substrate
Meas. Tech.
Inhibition Assay
IC50
<1000±n/a nM
Citation
 Kotian, PLBabu, YSZhang, WVogeti, LWu, MChintareddy, VRRaman, K Benzopyrazole compounds and analogues thereof US Patent  US10849883 Publication Date 12/1/2020 
Target
Name:
Complement factor D
Synonyms:
Adipsin CFAD_HUMAN DF Properdin factor D
Type:
Protein
Mol. Mass.:
27039.19
Organism:
Homo sapiens (Human)
Description:
P00746
Residue:
253
  
Inhibitor
Name:
BDBM474764
Synonyms:
US10849883, Compound 191a | US11559515, Compound 191a
Type:
Small organic molecule
Emp. Form.:
C29H29ClFN7O4
Mol. Mass.:
594.036
SMILES:
CC(C)N(CC(=O)NCc1cccc(Cl)c1F)C(=O)Cn1nc(C(N)=O)c2cc(ccc12)C(=O)NCc1ccccn1
: