Target
ADP-ribosylation factor 6
Ligand
BDBM474952
Substrate
Meas. Tech.
Biochemical Assay
IC50
0.330±n/a nM
Citation
 Ostanin, KShenderovich, MBajji, ACioffi, CLMoss, NVankayalapati, HLi, D Arf6 inhibitors and methods of synthesis and use thereof US Patent  US10849901 Publication Date 12/1/2020 
Target
Name:
ADP-ribosylation factor 6
Synonyms:
ARF6 | ARF6_HUMAN
Type:
Protein
Mol. Mass.:
20087.47
Organism:
Human
Description:
P62330
Residue:
175
  
Inhibitor
Name:
BDBM474952
Synonyms:
US10849901, Compound 2
Type:
Small organic molecule
Emp. Form.:
C25H12Cl2F5N3O2
Mol. Mass.:
552.28
SMILES:
Fc1cc(F)cc(Oc2cccc(c2)-c2cc(=O)n3nc(c(-c4ccc(Cl)c(Cl)c4)c3[nH]2)C(F)(F)F)c1
: