Target
ADP-ribosylation factor 6
Ligand
BDBM475042
Substrate
Meas. Tech.
Biochemical Assay
IC50
8.10±n/a nM
Citation
 Ostanin, KShenderovich, MBajji, ACioffi, CLMoss, NVankayalapati, HLi, D Arf6 inhibitors and methods of synthesis and use thereof US Patent  US10849901 Publication Date 12/1/2020 
Target
Name:
ADP-ribosylation factor 6
Synonyms:
ARF6 | ARF6_HUMAN
Type:
Protein
Mol. Mass.:
20087.47
Organism:
Human
Description:
P62330
Residue:
175
  
Inhibitor
Name:
BDBM475042
Synonyms:
US10849901, Compound 92
Type:
Small organic molecule
Emp. Form.:
C20H11ClF3N3O3
Mol. Mass.:
433.768
SMILES:
OC(=O)c1ccccc1-c1cc(=O)n2nc(c(-c3ccc(Cl)cc3)c2[nH]1)C(F)(F)F
: