Target
ADP-ribosylation factor 6
Ligand
BDBM475059
Substrate
Meas. Tech.
Biochemical Assay1
IC50
17.0±n/a nM
Citation
 Ostanin, KShenderovich, MBajji, ACioffi, CLMoss, NVankayalapati, HLi, D Arf6 inhibitors and methods of synthesis and use thereof US Patent  US10849901 Publication Date 12/1/2020 
Target
Name:
ADP-ribosylation factor 6
Synonyms:
ARF6 | ARF6_HUMAN
Type:
Protein
Mol. Mass.:
20087.47
Organism:
Human
Description:
P62330
Residue:
175
  
Inhibitor
Name:
BDBM475059
Synonyms:
US10849901, Compound 109
Type:
Small organic molecule
Emp. Form.:
C20H16N4O4
Mol. Mass.:
376.3654
SMILES:
COc1ccc(cc1)-c1c(C)nn2c1[nH]c(cc2=O)-c1ccc(cc1)[N+]([O-])=O
: