Target
ADP-ribosylation factor 6
Ligand
BDBM475064
Substrate
Meas. Tech.
Biochemical Assay
IC50
1.10±n/a nM
Citation
 Ostanin, KShenderovich, MBajji, ACioffi, CLMoss, NVankayalapati, HLi, D Arf6 inhibitors and methods of synthesis and use thereof US Patent  US10849901 Publication Date 12/1/2020 
Target
Name:
ADP-ribosylation factor 6
Synonyms:
ARF6 | ARF6_HUMAN
Type:
Protein
Mol. Mass.:
20087.47
Organism:
Human
Description:
P62330
Residue:
175
  
Inhibitor
Name:
BDBM475064
Synonyms:
US10849901, Compound 114
Type:
Small organic molecule
Emp. Form.:
C20H11Cl2N5O2
Mol. Mass.:
424.24
SMILES:
Nn1c(cc2c(C#N)c(=O)n(nc2c1=O)-c1ccc(Cl)cc1)-c1ccccc1Cl
: