Target
ADP-ribosylation factor 6
Ligand
BDBM475078
Substrate
Meas. Tech.
Biochemical Assay
IC50
8.40±n/a nM
Citation
 Ostanin, KShenderovich, MBajji, ACioffi, CLMoss, NVankayalapati, HLi, D Arf6 inhibitors and methods of synthesis and use thereof US Patent  US10849901 Publication Date 12/1/2020 
Target
Name:
ADP-ribosylation factor 6
Synonyms:
ARF6 | ARF6_HUMAN
Type:
Protein
Mol. Mass.:
20087.47
Organism:
Human
Description:
P62330
Residue:
175
  
Inhibitor
Name:
BDBM475078
Synonyms:
US10849901, Compound 128
Type:
Small organic molecule
Emp. Form.:
C24H23N3O4S
Mol. Mass.:
449.522
SMILES:
Cn1cc(\C=C(/CC(O)=O)C2Nc3ccccc3S2)c(n1)-c1ccc2OCCCOc2c1
: