Target
ADP-ribosylation factor 6
Ligand
BDBM475084
Substrate
Meas. Tech.
Biochemical Assay
IC50
13.0±n/a nM
Citation
 Ostanin, KShenderovich, MBajji, ACioffi, CLMoss, NVankayalapati, HLi, D Arf6 inhibitors and methods of synthesis and use thereof US Patent  US10849901 Publication Date 12/1/2020 
Target
Name:
ADP-ribosylation factor 6
Synonyms:
ARF6 | ARF6_HUMAN
Type:
Protein
Mol. Mass.:
20087.47
Organism:
Human
Description:
P62330
Residue:
175
  
Inhibitor
Name:
BDBM475084
Synonyms:
US10849901, Compound 134
Type:
Small organic molecule
Emp. Form.:
C22H18N4O5S
Mol. Mass.:
450.467
SMILES:
Cn1c(N)c(C(=O)COC(=O)c2ccccc2SCc2ccc(cc2)C#N)c(=O)[nH]c1=O
: