Target
Nuclear receptor ROR-gamma
Ligand
BDBM475863
Substrate
Meas. Tech.
Fluorescence Resonance Energy Transfer (FRET) Assay
IC50
<500±n/a nM
Citation
 Wang, YHuang, YYu, FTang, T Biaryl urea derivative or salt thereof and preparation process and use for the same US Patent  US10851050 Publication Date 12/1/2020 
Target
Name:
Nuclear receptor ROR-gamma
Synonyms:
NR1F3 Nuclear receptor ROR-gamma (RORC) RAR-related orphan receptor C (RORc) RORG RZRG Retinoid-related orphan receptor-gamma (RORc)
Type:
Enzyme Catalytic Domain
Mol. Mass.:
58218.40
Organism:
Homo sapiens (Human)
Description:
P51449
Residue:
518
  
Inhibitor
Name:
BDBM475863
Synonyms:
2-(4-((3-(2,6-dichloro-2′-(difluoromethoxy)-[1,1′-biphenyl]-4-yl)ureido)methyl)phenyl)acetic acid) | US10851050, Example I-20
Type:
Small organic molecule
Emp. Form.:
C23H18Cl2F2N2O4
Mol. Mass.:
495.303
SMILES:
OC(=O)Cc1ccc(CNC(=O)Nc2cc(Cl)c(c(Cl)c2)-c2ccccc2OC(F)F)cc1
: