Target
Egl nine homolog 1 [181-417]
Ligand
BDBM475504
Substrate
Meas. Tech.
Enzyme Activity Assay
IC50
1585±n/a nM
Citation
 Hocutt, FMLeonard, Jr., BEPeltier, HMPhuong, VKRabinowitz, MHRosen, MDTarantino, KTVenkatesan, HZhao, LX Benzoimidazoles as prolyl hydroxylase inhibitors US Patent  US10851083 Publication Date 12/1/2020 
Target
Name:
Egl nine homolog 1 [181-417]
Synonyms:
C1orf12 EGLN1_HUMAN | Egl nine homolog 1 (aa 181-417)
Type:
Enzyme
Mol. Mass.:
26555.51
Organism:
Homo sapiens (Human)
Description:
aa 181-417
Residue:
237
  
Inhibitor
Name:
BDBM475504
Synonyms:
1-(5-Fluoro-4-methyl-1H-benzoimidazol-2-yl)-1H- US11618744, Example 116
Type:
Small organic molecule
Emp. Form.:
C12H9FN4O2
Mol. Mass.:
260.2239
SMILES:
Cc1c(F)ccc2[nH]c(nc12)-n1cc(cn1)C(O)=O
: