Target
Tyrosine-protein phosphatase non-receptor type 11 [E76K]
Ligand
BDBM384152
Substrate
Meas. Tech.
Enzymatic Assay
IC50
75.0±n/a nM
Citation
 Jones, PCzako, BCross, JLeonard, PMseeh, FParker, CA Heterocyclic inhibitors of PTPN11 US Patent  US10851110 Publication Date 12/1/2020 
Target
Name:
Tyrosine-protein phosphatase non-receptor type 11 [E76K]
Synonyms:
PTN11_HUMAN PTPN11 SHPTP2 Tyrosine-protein phosphatase non-receptor type 11 (PTPN11)(E76K)
Type:
Enzyme Catalytic Domain
Mol. Mass.:
68019.14
Organism:
Homo sapiens (Human)
Description:
Q06124[E76K]
Residue:
593
  
Inhibitor
Name:
BDBM384152
Synonyms:
(S)-8-(3-(2,3-Dichlorophenyl)-1H-pyrazolo[3,4-b]pyrazin-6-yl)-2-oxa-8-azaspiro[4.5]-decan-4-amine US10851110, Example 38 | US11466017, Example 38
Type:
Small organic molecule
Emp. Form.:
C19H20Cl2N6O
Mol. Mass.:
419.308
SMILES:
N[C@@H]1COCC11CCN(CC1)c1cnc2c(n[nH]c2n1)-c1cccc(Cl)c1Cl
: