Target
Tyrosine-protein phosphatase non-receptor type 11 [E76K]
Ligand
BDBM384194
Substrate
Meas. Tech.
Enzymatic Assay
IC50
779±n/a nM
Citation
 Jones, PCzako, BCross, JLeonard, PMseeh, FParker, CA Heterocyclic inhibitors of PTPN11 US Patent  US10851110 Publication Date 12/1/2020 
Target
Name:
Tyrosine-protein phosphatase non-receptor type 11 [E76K]
Synonyms:
PTN11_HUMAN PTPN11 SHPTP2 Tyrosine-protein phosphatase non-receptor type 11 (PTPN11)(E76K)
Type:
Enzyme Catalytic Domain
Mol. Mass.:
68019.14
Organism:
Homo sapiens (Human)
Description:
Q06124[E76K]
Residue:
593
  
Inhibitor
Name:
BDBM384194
Synonyms:
1-(3-(2-Amino-3-chloropyridin-4-yl)-1H-pyrazolo[3,4-b]pyrazin-6-yl)-4-(aminomethyl)piperidin-4-ol US10851110, Example 114 | US11466017, Example 114
Type:
Small organic molecule
Emp. Form.:
C16H19ClN8O
Mol. Mass.:
374.828
SMILES:
NCC1(O)CCN(CC1)c1cnc2c(n[nH]c2n1)-c1ccnc(N)c1Cl
: