Target
Tyrosine-protein phosphatase non-receptor type 11 [E76K]
Ligand
BDBM384204
Substrate
Meas. Tech.
Enzymatic Assay
IC50
377±n/a nM
Citation
 Jones, PCzako, BCross, JLeonard, PMseeh, FParker, CA Heterocyclic inhibitors of PTPN11 US Patent  US10851110 Publication Date 12/1/2020 
Target
Name:
Tyrosine-protein phosphatase non-receptor type 11 [E76K]
Synonyms:
PTN11_HUMAN PTPN11 SHPTP2 Tyrosine-protein phosphatase non-receptor type 11 (PTPN11)(E76K)
Type:
Enzyme Catalytic Domain
Mol. Mass.:
68019.14
Organism:
Homo sapiens (Human)
Description:
Q06124[E76K]
Residue:
593
  
Inhibitor
Name:
BDBM384204
Synonyms:
4-(6-(4-(Aminomethyl)-4-methylpiperidin-1-yl)-1H-pyrazolo[3,4-b]pyrazin-3-yl)-3-methylpyridin-2-amine US10851110, Example 124 | US11466017, Example 124
Type:
Small organic molecule
Emp. Form.:
C18H24N8
Mol. Mass.:
352.4368
SMILES:
Cc1c(N)nccc1-c1n[nH]c2nc(cnc12)N1CCC(C)(CN)CC1
: