Target
Tyrosine-protein phosphatase non-receptor type 11 [E76K]
Ligand
BDBM384210
Substrate
Meas. Tech.
Enzymatic Assay
IC50
840±n/a nM
Citation
 Jones, PCzako, BCross, JLeonard, PMseeh, FParker, CA Heterocyclic inhibitors of PTPN11 US Patent  US10851110 Publication Date 12/1/2020 
Target
Name:
Tyrosine-protein phosphatase non-receptor type 11 [E76K]
Synonyms:
PTN11_HUMAN PTPN11 SHPTP2 Tyrosine-protein phosphatase non-receptor type 11 (PTPN11)(E76K)
Type:
Enzyme Catalytic Domain
Mol. Mass.:
68019.14
Organism:
Homo sapiens (Human)
Description:
Q06124[E76K]
Residue:
593
  
Inhibitor
Name:
BDBM384210
Synonyms:
4-{6-[4-(amino- methyl)-4-methyl- piperidin-1-yl]-1H- pyrazolo[3,4-b]- pyrazin-3-yl}-5- chloropyridin-2- amine US10851110, Example 133 | US11466017, Example 133
Type:
Small organic molecule
Emp. Form.:
C17H21ClN8
Mol. Mass.:
372.855
SMILES:
CC1(CN)CCN(CC1)c1cnc2c(n[nH]c2n1)-c1cc(N)ncc1Cl
: