Target
Tyrosine-protein kinase JAK2
Ligand
BDBM475683
Substrate
Meas. Tech.
Kinase Assay
EC50
80.0±n/a nM
Citation
 Greve, DRJepsen, THLarsen, MRitzen, A Bicyclic amines as novel JAK kinase inhibitors US Patent  US10851116 Publication Date 12/1/2020 
Target
Name:
Tyrosine-protein kinase JAK2
Synonyms:
JAK-2 JAK2_HUMAN Janus kinase 2 (JAK2) | Janus kinase 2 (a protein tyrosine kinase)
Type:
Protein
Mol. Mass.:
130684.68
Organism:
Homo sapiens (Human)
Description:
O60674
Residue:
1132
  
Inhibitor
Name:
BDBM475683
Synonyms:
6- [(4aR*,8aS*)- 8a-methyl-7- (7H- pyrrolo[2,3- d]pyrimidin-4- yl)- 3,4,4a,5,6,8- hexahydro-1H- 2,7- naphthyridin-2- yl]pyridine-3- carbonitrile | US10851116, Example 5
Type:
Small organic molecule
Emp. Form.:
C21H23N7
Mol. Mass.:
373.4542
SMILES:
C[C@]12CN(CC[C@H]1CCN(C2)c1ncnc2[nH]ccc12)c1ccc(cn1)C#N
: