Target
Non-receptor tyrosine-protein kinase TYK2
Ligand
BDBM475717
Substrate
Meas. Tech.
Kinase Assay
EC50
775±n/a nM
Citation
 Greve, DRJepsen, THLarsen, MRitzen, A Bicyclic amines as novel JAK kinase inhibitors US Patent  US10851116 Publication Date 12/1/2020 
Target
Name:
Non-receptor tyrosine-protein kinase TYK2
Synonyms:
Non-receptor tyrosine-protein kinase TYK2 (TYK2) TYK2_HUMAN | Tyrosine-protein kinase TYK2
Type:
Protein
Mol. Mass.:
133666.03
Organism:
Homo sapiens (Human)
Description:
P29597
Residue:
1187
  
Inhibitor
Name:
BDBM475717
Synonyms:
4-[(3aR*,7aS*)-3a-methyl-2-pyrimidin-4-yl-1,3,4,6,7,7a-hexahydropyrrolo[3,4-c]pyridin-5-yl]-7H-pyrrolo[2,3-d]pyrimidine | US10851116, Example 39
Type:
Small organic molecule
Emp. Form.:
C18H21N7
Mol. Mass.:
335.4062
SMILES:
C[C@]12CN(C[C@H]1CCN(C2)c1ncnc2[nH]ccc12)c1ccncn1
: