Target
Tyrosine-protein kinase JAK1
Ligand
BDBM475721
Substrate
Meas. Tech.
Kinase Assay
EC50
3.00±n/a nM
Citation
 Greve, DRJepsen, THLarsen, MRitzen, A Bicyclic amines as novel JAK kinase inhibitors US Patent  US10851116 Publication Date 12/1/2020 
Target
Name:
Tyrosine-protein kinase JAK1
Synonyms:
JAK-1 JAK1A JAK1_HUMAN Janus kinase 1 (JAK1) | Janus kinase 1 JAK1
Type:
Protein
Mol. Mass.:
133293.73
Organism:
Homo sapiens (Human)
Description:
P23458
Residue:
1154
  
Inhibitor
Name:
BDBM475721
Synonyms:
5-[(3aS*,7aS*)-3a-methyl-5-(7H-pyrrolo[2,3-d]pyrimidin-4-yl)-1,3,4,6,7,7a-hexahydropyrrolo[3,4-c]pyridin-2-yl]pyrazine-2-carbonitrile | US10851116, Example 43
Type:
Small organic molecule
Emp. Form.:
C19H20N8
Mol. Mass.:
360.4157
SMILES:
C[C@]12CN(C[C@H]1CCN(C2)c1ncnc2[nH]ccc12)c1cnc(cn1)C#N
: