Target
Cytochrome P450 26A1
Ligand
BDBM476180
Substrate
Meas. Tech.
Cell-Based Inhibitor Assay
IC50
830±n/a nM
Citation
 Cameron, DAPetkovich, MRantanen, TKSnieckus, VBoard, JSingh, SMaheta, AJ Compounds and methods for inhibiting CYP26 enzymes US Patent  US10874634 Publication Date 12/29/2020 
Target
Name:
Cytochrome P450 26A1
Synonyms:
CP26A_HUMAN CYP26A1 Cytochrome P450 26A1 P450RAI1 | Retinoic acid 4-hydroxylase
Type:
Enzyme
Mol. Mass.:
56216.16
Organism:
Homo sapiens (Human)
Description:
O43174
Residue:
497
  
Inhibitor
Name:
BDBM476180
Synonyms:
US10874634, Cmpd No. 02 | US11364220, Compound 02
Type:
Small organic molecule
Emp. Form.:
C24H29NO3
Mol. Mass.:
379.492
SMILES:
Cc1cc2c(cc1C(=O)Nc1ccc(CC(O)=O)cc1)C(C)(C)CCC2(C)C
: