Target
Capsid protein
Ligand
BDBM400029
Substrate
Meas. Tech.
HBV DNA Quantification Assay
EC50
103±n/a nM
Citation
 Du, JKaplan, JAKirschberg, TAKobayashi, TLazerwith, SELee, RAMedley, JWMitchell, MLMorganelli, PAPyun, HShevick, SLSquires, NHWatkins, WJ Substituted pyrrolizine compounds and uses thereof US Patent  US10874640 Publication Date 12/29/2020 
Target
Name:
Capsid protein
Synonyms:
C Core antigen HBcAg | p21.5
Type:
Enzyme Catalytic Domain
Mol. Mass.:
21105.01
Organism:
Hepatitis B virus genotype C subtype ayr (isolate Human/Japan/Okamoto/-) (HBV-C)
Description:
Residue:
183
  
Inhibitor
Name:
BDBM400029
Synonyms:
N-(3-chloro-4-fluorophenyl)-7-(2-((3,3-difluoro-1-(((3-methyl-1,1-dioxidothietan-3-yl)amino)methyl)cyclobutyl)amino)-2-oxoacetyl)-6-methyl-2,3-dihydro-1H-pyrrolizine-5-carboxamide US10328053, Compound 9 US20230270719, Compound 9
Type:
Small organic molecule
Emp. Form.:
C26H26ClF3N4O6S
Mol. Mass.:
615.021
SMILES:
Cc1c(C(=O)C(=O)NC2(CC(F)(F)C2)C(=O)NC2(C)CS(=O)(=O)C2)c2CCCn2c1C(=O)Nc1ccc(F)c(Cl)c1
: