Target
Capsid protein
Ligand
BDBM476317
Substrate
Meas. Tech.
HBV DNA Quantification Assay
EC50
47.8±n/a nM
Citation
 Du, JKaplan, JAKirschberg, TAKobayashi, TLazerwith, SELee, RAMedley, JWMitchell, MLMorganelli, PAPyun, HShevick, SLSquires, NHWatkins, WJ Substituted pyrrolizine compounds and uses thereof US Patent  US10874640 Publication Date 12/29/2020 
Target
Name:
Capsid protein
Synonyms:
C Core antigen HBcAg | p21.5
Type:
Enzyme Catalytic Domain
Mol. Mass.:
21105.01
Organism:
Hepatitis B virus genotype C subtype ayr (isolate Human/Japan/Okamoto/-) (HBV-C)
Description:
Residue:
183
  
Inhibitor
Name:
BDBM476317
Synonyms:
US10874640, Compound 79 | US20230270719, Compound 79
Type:
Small organic molecule
Emp. Form.:
C24H20FN7O3
Mol. Mass.:
473.4591
SMILES:
Cc1c(C(=O)C(=O)NC2(CC2)c2c[nH]nn2)c2C[C@H]3C[C@H]3n2c1C(=O)Nc1ccc(F)c(c1)C#N
: