Target
Capsid protein
Ligand
BDBM400113
Substrate
Meas. Tech.
HBV DNA Quantification Assay
EC50
91.1±n/a nM
Citation
 Du, JKaplan, JAKirschberg, TAKobayashi, TLazerwith, SELee, RAMedley, JWMitchell, MLMorganelli, PAPyun, HShevick, SLSquires, NHWatkins, WJ Substituted pyrrolizine compounds and uses thereof US Patent  US10874640 Publication Date 12/29/2020 
Target
Name:
Capsid protein
Synonyms:
C Core antigen HBcAg | p21.5
Type:
Enzyme Catalytic Domain
Mol. Mass.:
21105.01
Organism:
Hepatitis B virus genotype C subtype ayr (isolate Human/Japan/Okamoto/-) (HBV-C)
Description:
Residue:
183
  
Inhibitor
Name:
BDBM400113
Synonyms:
7-(2-((1-(1H-1,2,3-triazol-4-yl)cyclopropyl)amino)-2-oxoacetyl)-N-(5-chloro-2,4-difluorophenyl)-6-methyl-2,3-dihydro-1H-pyrrolizine-5-carboxamide US10874640, Compound 91 | US20230270719, Compound 91
Type:
Small organic molecule
Emp. Form.:
C22H19ClF2N6O3
Mol. Mass.:
488.874
SMILES:
Cc1c(C(=O)C(=O)NC2(CC2)c2c[nH]nn2)c2CCCn2c1C(=O)Nc1cc(Cl)c(F)cc1F
: