Target
Capsid protein
Ligand
BDBM400120
Substrate
Meas. Tech.
HBV DNA Quantification Assay
EC50
51.3±n/a nM
Citation
 Du, JKaplan, JAKirschberg, TAKobayashi, TLazerwith, SELee, RAMedley, JWMitchell, MLMorganelli, PAPyun, HShevick, SLSquires, NHWatkins, WJ Substituted pyrrolizine compounds and uses thereof US Patent  US10874640 Publication Date 12/29/2020 
Target
Name:
Capsid protein
Synonyms:
C Core antigen HBcAg | p21.5
Type:
Enzyme Catalytic Domain
Mol. Mass.:
21105.01
Organism:
Hepatitis B virus genotype C subtype ayr (isolate Human/Japan/Okamoto/-) (HBV-C)
Description:
Residue:
183
  
Inhibitor
Name:
BDBM400120
Synonyms:
(1aR,6aR)-5-(2-((1-(1H-1,2,3-triazol-5-yl)cyclopropyl)amino)-2-oxoacetyl)-N-(4-fluorophenyl)-4-methyl-1,1a,6,6a-tetrahydrocyclopropa[b]pyrrolizine-3-carboxamide US10874640, Compound 99 | US20230270719, Compound 99
Type:
Small organic molecule
Emp. Form.:
C23H21FN6O3
Mol. Mass.:
448.4496
SMILES:
Cc1c(C(=O)C(=O)NC2(CC2)c2cnn[nH]2)c2C[C@H]3C[C@H]3n2c1C(=O)Nc1ccc(F)cc1
: