Target
Capsid protein
Ligand
BDBM400132
Substrate
Meas. Tech.
HBV DNA Quantification Assay
EC50
156±n/a nM
Citation
 Du, JKaplan, JAKirschberg, TAKobayashi, TLazerwith, SELee, RAMedley, JWMitchell, MLMorganelli, PAPyun, HShevick, SLSquires, NHWatkins, WJ Substituted pyrrolizine compounds and uses thereof US Patent  US10874640 Publication Date 12/29/2020 
Target
Name:
Capsid protein
Synonyms:
C Core antigen HBcAg | p21.5
Type:
Enzyme Catalytic Domain
Mol. Mass.:
21105.01
Organism:
Hepatitis B virus genotype C subtype ayr (isolate Human/Japan/Okamoto/-) (HBV-C)
Description:
Residue:
183
  
Inhibitor
Name:
BDBM400132
Synonyms:
N-(3-(difluoromethyl)-4-fluorophenyl)-6-methyl-7-(2-((2-methyl-1-(methylamino)-1-oxopropan-2-yl)amino)-2-oxoacetyl)-2,3-dihydro-1H-pyrrolizine-5-carboxamide US10874640, Compound 114 | US20230270719, Compound 114
Type:
Small organic molecule
Emp. Form.:
C23H25F3N4O4
Mol. Mass.:
478.4642
SMILES:
CNC(=O)C(C)(C)NC(=O)C(=O)c1c(C)c(C(=O)Nc2ccc(F)c(c2)C(F)F)n2CCCc12
: