Target
Capsid protein
Ligand
BDBM400137
Substrate
Meas. Tech.
HBV DNA Quantification Assay
EC50
25.8±n/a nM
Citation
 Du, JKaplan, JAKirschberg, TAKobayashi, TLazerwith, SELee, RAMedley, JWMitchell, MLMorganelli, PAPyun, HShevick, SLSquires, NHWatkins, WJ Substituted pyrrolizine compounds and uses thereof US Patent  US10874640 Publication Date 12/29/2020 
Target
Name:
Capsid protein
Synonyms:
C Core antigen HBcAg | p21.5
Type:
Enzyme Catalytic Domain
Mol. Mass.:
21105.01
Organism:
Hepatitis B virus genotype C subtype ayr (isolate Human/Japan/Okamoto/-) (HBV-C)
Description:
Residue:
183
  
Inhibitor
Name:
BDBM400137
Synonyms:
(1aR,6aR)-N-(2-(difluoromethyl)pyridin-4-yl)-4-methyl-5-(2-oxo-2-((3-(trifluoromethyl)oxetan-3-yl) amino)acetyl)-1,1a,6,6a-tetrahydrocyclopropa[b]pyrrolizine-3-carboxamide US10874640, Compound 119 | US20230270719, Compound 119
Type:
Small organic molecule
Emp. Form.:
C22H19F5N4O4
Mol. Mass.:
498.4027
SMILES:
Cc1c(C(=O)C(=O)NC2(COC2)C(F)(F)F)c2C[C@H]3C[C@H]3n2c1C(=O)Nc1ccnc(c1)C(F)F
: