Target
Capsid protein
Ligand
BDBM400145
Substrate
Meas. Tech.
HBV DNA Quantification Assay
EC50
20.4±n/a nM
Citation
 Du, JKaplan, JAKirschberg, TAKobayashi, TLazerwith, SELee, RAMedley, JWMitchell, MLMorganelli, PAPyun, HShevick, SLSquires, NHWatkins, WJ Substituted pyrrolizine compounds and uses thereof US Patent  US10874640 Publication Date 12/29/2020 
Target
Name:
Capsid protein
Synonyms:
C Core antigen HBcAg | p21.5
Type:
Enzyme Catalytic Domain
Mol. Mass.:
21105.01
Organism:
Hepatitis B virus genotype C subtype ayr (isolate Human/Japan/Okamoto/-) (HBV-C)
Description:
Residue:
183
  
Inhibitor
Name:
BDBM400145
Synonyms:
N-(3-chloro-4,5-difluorophenyl)-7-(2-((3,3-difluoro-1-(methylcarbamoyl)cyclobutyl)amino)-2-oxoacetyl)-6-methyl-2,3-dihydro-1H-pyrrolizine-5-carboxamide US10874640, Compound 129 | US20230270719, Compound 129
Type:
Small organic molecule
Emp. Form.:
C23H21ClF4N4O4
Mol. Mass.:
528.884
SMILES:
CNC(=O)C1(CC(F)(F)C1)NC(=O)C(=O)c1c(C)c(C(=O)Nc2cc(F)c(F)c(Cl)c2)n2CCCc12
: