Target
D(2) dopamine receptor
Ligand
BDBM50392122
Substrate
Meas. Tech.
radioligand competition assay
Ki
134±12 nM
Citation
 Dutta, AK Neuroprotective agents for treatment of neurodegenerative diseases US Patent  US10874669 Publication Date 12/29/2020 
Target
Name:
D(2) dopamine receptor
Synonyms:
DOPAMINE D2 DOPAMINE D2 Short Dopamine D2 receptor Drd2
Type:
G Protein-Coupled Receptor (GPCR)
Mol. Mass.:
50931.60
Organism:
Rattus norvegicus (rat)
Description:
P61169
Residue:
444
  
Inhibitor
Name:
BDBM50392122
Synonyms:
CHEMBL2152633 | US10874669, Compound (+)-10
Type:
Small organic molecule
Emp. Form.:
C24H34N6S
Mol. Mass.:
438.632
SMILES:
CCCN(CCN1CCN(CC1)c1ccc2[nH]ccc2c1)[C@H]1CCc2nc(N)sc2C1
: