Target
UDP-3-O-acyl-N-acetylglucosamine deacetylase
Ligand
BDBM476342
Substrate
Meas. Tech.
nhibition Assay against Klebsiella pneumoniae LpxC
IC50
55±0 nM
Citation
 Teng, MNammalwar, BTaganov, KPuerta, DT Substituted pyrimidines for treating bacterial infections US Patent  US10875832 Publication Date 12/29/2020 
Target
Name:
UDP-3-O-acyl-N-acetylglucosamine deacetylase
Synonyms:
LPXC_KLEP7 UDP-3-O-acyl-GlcNAc deacetylase | lpxC
Type:
Protein
Mol. Mass.:
34042.19
Organism:
Description:
A6T4N9
Residue:
305
 
Inhibitor
Name:
BDBM476342
Synonyms:
US10875832, Compound 97
Type:
Small organic molecule
Emp. Form.:
C26H22N4O4
Mol. Mass.:
454.4773
SMILES:
Oc1c(CNc2ccc(cc2)C#CC#Cc2ccc(cc2)C(=O)N2CCOCC2)nc[nH]c1=O
: