Target
Coagulation factor XII
Ligand
BDBM476399
Substrate
Meas. Tech.
Factor XIIa Assay
IC50
1.10±n/a nM
Citation
 Rao, AUMcKittrick, BALombardo, MHicks, JDBittner McCracken, AChu, HDSo, SOrth, PWu, ZLan, PDebenham, JSWhitehead, BRTaylor, JASun, ZKatipally, RRGable, JEDahlgren, MKBhat, SP Factor XIIa inhibitors US Patent  US10875851 Publication Date 12/29/2020 
Target
Name:
Coagulation factor XII
Synonyms:
Beta-factor XIIa part 1 Carboxylesterase 2 (intestine, liver) Coagulation factor XII (FXII) Coagulation factor XIIa light chain FA12_HUMAN Factor XIIa (fXIIa) Hageman factor
Type:
Enzyme
Mol. Mass.:
67810.07
Organism:
Homo sapiens (Human)
Description:
P00748
Residue:
615
  
Inhibitor
Name:
BDBM476399
Synonyms:
3-(aminomethyl)-2-chlorophenyl (3S)- 4-(N,3-dicyclohexyl-D-alanyl)-3- [(thiophen-2- ylmethyl)carbamoyl]piperazine-1- carboxylate | US10875851, Example 55
Type:
Small organic molecule
Emp. Form.:
C33H46ClN5O4S
Mol. Mass.:
644.267
SMILES:
NCc1cccc(OC(=O)N2CCN([C@@H](C2)C(=O)NCc2cccs2)C(=O)[C@@H](CC2CCCCC2)NC2CCCCC2)c1Cl
: