Target
Coagulation factor XII
Ligand
BDBM476429
Substrate
Meas. Tech.
Factor XIIa Assay
IC50
8.30±n/a nM
Citation
 Rao, AUMcKittrick, BALombardo, MHicks, JDBittner McCracken, AChu, HDSo, SOrth, PWu, ZLan, PDebenham, JSWhitehead, BRTaylor, JASun, ZKatipally, RRGable, JEDahlgren, MKBhat, SP Factor XIIa inhibitors US Patent  US10875851 Publication Date 12/29/2020 
Target
Name:
Coagulation factor XII
Synonyms:
Beta-factor XIIa part 1 Carboxylesterase 2 (intestine, liver) Coagulation factor XII (FXII) Coagulation factor XIIa light chain FA12_HUMAN Factor XIIa (fXIIa) Hageman factor
Type:
Enzyme
Mol. Mass.:
67810.07
Organism:
Homo sapiens (Human)
Description:
P00748
Residue:
615
  
Inhibitor
Name:
BDBM476429
Synonyms:
2-chlorophenyl (3S)-3-{[4- (aminomethyl)-3- methoxybenzyl]carbamoyl}-4-[N2-(2- benzyl-2-azaspiro[4.5]dec-8-yl)-N6- (methylsulfonyl)-D-lysyl]piperazine- 1-carboxylate | US10875851, Example 85
Type:
Small organic molecule
Emp. Form.:
C44H60ClN7O7S
Mol. Mass.:
866.508
SMILES:
COc1cc(CNC(=O)[C@@H]2CN(CCN2C(=O)[C@@H](CCCCNS(C)(=O)=O)NC2CCC3(CCN(Cc4ccccc4)C3)CC2)C(=O)Oc2ccccc2Cl)ccc1CN
: