Target
Coagulation factor XII
Ligand
BDBM476479
Substrate
Meas. Tech.
Factor XIIa Assay
IC50
0.800±n/a nM
Citation
 Rao, AUMcKittrick, BALombardo, MHicks, JDBittner McCracken, AChu, HDSo, SOrth, PWu, ZLan, PDebenham, JSWhitehead, BRTaylor, JASun, ZKatipally, RRGable, JEDahlgren, MKBhat, SP Factor XIIa inhibitors US Patent  US10875851 Publication Date 12/29/2020 
Target
Name:
Coagulation factor XII
Synonyms:
Beta-factor XIIa part 1 Carboxylesterase 2 (intestine, liver) Coagulation factor XII (FXII) Coagulation factor XIIa light chain FA12_HUMAN Factor XIIa (fXIIa) Hageman factor
Type:
Enzyme
Mol. Mass.:
67810.07
Organism:
Homo sapiens (Human)
Description:
P00748
Residue:
615
  
Inhibitor
Name:
BDBM476479
Synonyms:
(2S)-1-[N2-(2-benzyl-2- azaspiro[4.5]dec-8-yl)-N6,N6- dimethyl-D-lysyl]-4-[(4S,5S)-4- methyl-5-phenyl-4,5-dihydro-1,3- oxazol-2-yl]-N-(thiophen-2- ylmethyl)piperazine-2-carboxamide | US10875851, Example 135
Type:
Small organic molecule
Emp. Form.:
C44H61N7O3S
Mol. Mass.:
768.065
SMILES:
C[C@@H]1N=C(O[C@H]1c1ccccc1)N1CCN([C@@H](C1)C(=O)NCc1cccs1)C(=O)[C@@H](CCCCN(C)C)NC1CCC2(CCN(Cc3ccccc3)C2)CC1
: