Target
Coagulation factor XII
Ligand
BDBM476526
Substrate
Meas. Tech.
Factor XIIa Assay
IC50
34.2±n/a nM
Citation
 Rao, AUMcKittrick, BALombardo, MHicks, JDBittner McCracken, AChu, HDSo, SOrth, PWu, ZLan, PDebenham, JSWhitehead, BRTaylor, JASun, ZKatipally, RRGable, JEDahlgren, MKBhat, SP Factor XIIa inhibitors US Patent  US10875851 Publication Date 12/29/2020 
Target
Name:
Coagulation factor XII
Synonyms:
Beta-factor XIIa part 1 Carboxylesterase 2 (intestine, liver) Coagulation factor XII (FXII) Coagulation factor XIIa light chain FA12_HUMAN Factor XIIa (fXIIa) Hageman factor
Type:
Enzyme
Mol. Mass.:
67810.07
Organism:
Homo sapiens (Human)
Description:
P00748
Residue:
615
  
Inhibitor
Name:
BDBM476526
Synonyms:
(2S)-1-{N-(4-carbamoylcyclohexyl)-3- [1-(4-carbamoylcyclohexyl)piperidin- 4-yl]-D-alanyl}-4-[(4S,5S)-4-methyl- 5-phenyl-4,5-dihydro-1,3-oxazol-2- yl]-N-(thiophen-2- ylmethyl)piperazine-2-carboxamide | US10875851, Example 182
Type:
Small organic molecule
Emp. Form.:
C42H60N8O5S
Mol. Mass.:
789.041
SMILES:
C[C@@H]1N=C(O[C@H]1c1ccccc1)N1CCN([C@@H](C1)C(=O)NCc1cccs1)C(=O)[C@@H](CC1CCN(CC1)C1CCC(CC1)C(N)=O)NC1CCC(CC1)C(N)=O
: