Target
Histone deacetylase 2
Ligand
BDBM476613
Substrate
Meas. Tech.
Inhibition Assay
IC50
43.6±33.16 nM
Citation
 Chou, CJMcClure, JZhang, CInks, E Histone deacetylase inhibitors and uses thereof US Patent  US10870618 Publication Date 12/22/2020 
Target
Name:
Histone deacetylase 2
Synonyms:
Cereblon/Histone deacetylase 2 HDAC2 Histone deacetylase 2 (HDAC2) | Human HDAC2
Type:
Chromatin regulator; hydrolase; repressor
Mol. Mass.:
55356.54
Organism:
Homo sapiens (Human)
Description:
Q92769
Residue:
488
  
Inhibitor
Name:
BDBM476613
Synonyms:
N-(4-(2-pentylhydrazine-1- carbonyl)benzyl)benzamide | US10870618, Compound 2e
Type:
Small organic molecule
Emp. Form.:
C20H25N3O2
Mol. Mass.:
339.4314
SMILES:
CCCCCNNC(=O)c1ccc(CNC(=O)c2ccccc2)cc1
: