Target
Histone deacetylase 1
Ligand
BDBM476626
Substrate
Meas. Tech.
Inhibition Assay
IC50
11.8±4.16 nM
Citation
 Chou, CJMcClure, JZhang, CInks, E Histone deacetylase inhibitors and uses thereof US Patent  US10870618 Publication Date 12/22/2020 
Target
Name:
Histone deacetylase 1
Synonyms:
Cereblon/Histone deacetylase 1 HDAC1 Histone deacetylase 1 (HDAC1) RPD3L1
Type:
Enzyme
Mol. Mass.:
55090.27
Organism:
Homo sapiens (Human)
Description:
Q13547
Residue:
482
  
Inhibitor
Name:
BDBM476626
Synonyms:
N-(4-(2-propylhydrazine-1- carbonyl)benzyl)cinnamamide | US10870618, Compound 3b
Type:
Small organic molecule
Emp. Form.:
C20H23N3O2
Mol. Mass.:
337.4155
SMILES:
CCCNNC(=O)c1ccc(CNC(=O)\C=C\c2ccccc2)cc1
: