Target
Serine/threonine-protein kinase Chk2
Ligand
BDBM50526803
Substrate
Meas. Tech.
Inhibition of Kinase Activity
IC50
<100.0±n/a nM
Citation
 Gray, NSLiang, YZhang, TKwiatkowski, NP Inhibitors of cyclin-dependent kinase 7 (CDK7) US Patent  US10870651 Publication Date 12/22/2020 
Target
Name:
Serine/threonine-protein kinase Chk2
Synonyms:
CDS1 CHK2 Checkpoint Kinase (Chk2) Serine/threonine-protein kinase Chek2 | Serine/threonine-protein kinase Chk1/2
Type:
Protein
Mol. Mass.:
60908.59
Organism:
Homo sapiens (Human)
Description:
O96017
Residue:
543
  
Inhibitor
Name:
BDBM50526803
Synonyms:
CHEMBL4434871 | US10870651, Compound 101
Type:
Small organic molecule
Emp. Form.:
C34H38N8O3
Mol. Mass.:
606.7173
SMILES:
CN(C)C[C@@H](NC(=O)N1Cc2c(Nc3cccc(NC(=O)c4ccc(NC(=O)C=C)cc4)c3)n[nH]c2C1(C)C)c1ccccc1
: