Target
D(3) dopamine receptor
Ligand
BDBM476779
Substrate
Meas. Tech.
Binding Assay
Ki
0.130±n/a nM
Citation
 Tobinaga, HMasuda, KInagaki, MYonehara, MMasuda, M Nitrogen-containing condensed ring compounds having dopamine D3 antagonistic effect US Patent  US10870660 Publication Date 12/22/2020 
Target
Name:
D(3) dopamine receptor
Synonyms:
DOPAMINE D3 DRD3_HUMAN Dopamine D3 receptor (D3) Dopamine receptor Dopamine receptor D3
Type:
Mol. Mass.:
44243.43
Organism:
Homo sapiens (Human)
Description:
Residue:
400
  
Inhibitor
Name:
BDBM476779
Synonyms:
US10870660, Compound III-168 | US11345716, Compound III-168
Type:
Small organic molecule
Emp. Form.:
C23H30F3N5O3S
Mol. Mass.:
513.576
SMILES:
Cn1cc(\C=C\C(=O)N[C@H]2CC[C@H](CCN3CCc4nc(OCC(F)(F)F)sc4CC3)OC2)cn1
: