Target
Programmed cell death 1 ligand/protein 1
Ligand
BDBM477010
Substrate
Meas. Tech.
Homogenous Time-Resolved Fluorescence (HTRF) binding assay
IC50
1.70±n/a nM
Citation
 Yeung, KGrant-Young, KASun, LLangley, DRSt. Laurent, DRScola, PM Compounds useful as immunomodulators US Patent  US10882844 Publication Date 1/5/2021 
Target
Name:
Programmed cell death 1 ligand/protein 1
Synonyms:
PD-1/PD-L1 | Programmed cell death protein 1/Programmed cell death 1 ligand 1
Type:
Protein
Mol. Mass.:
Description:
Components:
This complex has 2 components.
Component 1
Name:
Programmed cell death protein 1
Synonyms:
CD_antigen=CD279 PDCD1 Programmed cell death protein 1 hPD-1
Type:
PROTEIN
Mol. Mass.:
31650.07
Organism:
Homo sapiens
Description:
ChEMBL_108437
Residue:
288
  
Component 2
Name:
Programmed cell death 1 ligand 1
Synonyms:
B7 homolog 1 B7H1 CD274 PD-L1 PDCD1 ligand 1 PDCD1LG1 Programmed cell death 1 ligand 1 | Programmed death ligand 1
Type:
PROTEIN
Mol. Mass.:
33278.49
Organism:
Homo sapiens (Human)
Description:
ChEMBL_109807
Residue:
290
  
Inhibitor
Name:
BDBM477010
Synonyms:
US10882844, Example 1027
Type:
Small organic molecule
Emp. Form.:
C41H39ClN6O4
Mol. Mass.:
715.239
SMILES:
Cc1c(COc2cc(OCc3cncc(c3)C#N)c(CN3CCCC[C@H]3C(O)=O)cc2Cl)cccc1-c1ccc2ncc(nc2c1)C1=CCCNC1
: