Target
Hepatocyte growth factor receptor
Ligand
BDBM477044
Substrate
Meas. Tech.
Inhibitory Activity Assay
IC50
17.0±n/a nM
Citation
 Sun, FZhan, Y Tyrosine kinase inhibitor and application thereof US Patent  US10882853 Publication Date 1/5/2021 
Target
Name:
Hepatocyte growth factor receptor
Synonyms:
Hepatocyte growth factor receptor Hepatocyte growth factor receptor (c-MET) MET Met proto-oncogene (hepatocyte growth factor receptor) Tyrosine-protein kinase Met (c-Met) c-Met kinase
Type:
Protein
Mol. Mass.:
155559.73
Organism:
Homo sapiens (Human)
Description:
P08581
Residue:
1390
  
Inhibitor
Name:
BDBM477044
Synonyms:
US10882853, Compound 10
Type:
Small organic molecule
Emp. Form.:
C35H34F2N4O6
Mol. Mass.:
644.6645
SMILES:
COc1cc2c(Oc3ccc(NC(=O)C4(CC4)C(=O)Nc4ccc(F)cc4)cc3F)ccnc2cc1OC1CC(C1)N1CCOCC1
: