Target
Ectonucleotide pyrophosphatase/phosphodiesterase family member 2
Ligand
BDBM477051
Substrate
Meas. Tech.
Enzyme Inhibition Assay
IC50
5.00±n/a nM
Citation
 Hert, JHunziker, DMattei, PRudolph, MSchmitz, PDi Giorgio, P Bicyclic compounds as ATX inhibitors US Patent  US10882857 Publication Date 1/5/2021 
Target
Name:
Ectonucleotide pyrophosphatase/phosphodiesterase family member 2
Synonyms:
ATX Autotaxin (ATX) ENPP2 Ectonucleotide Pyrophosphatase/Phosphodiesterase 2 (ENPP2) Extracellular lysophospholipase D PDNP2
Type:
Enzyme
Mol. Mass.:
99007.13
Organism:
Homo sapiens (Human)
Description:
Q13822
Residue:
863
  
Inhibitor
Name:
BDBM477051
Synonyms:
US10882857, Example 1.03 | US11673888, Example 1.03
Type:
Small organic molecule
Emp. Form.:
C27H31N7O4S
Mol. Mass.:
549.645
SMILES:
O=C(N1CCc2[nH]nnc2C1)c1nc2CCN(Cc2s1)C(=O)c1cnc(OCC2CCOCC2)c(c1)C1CC1
: