Target
Ectonucleotide pyrophosphatase/phosphodiesterase family member 2
Ligand
BDBM477059
Substrate
Meas. Tech.
Enzyme Inhibition Assay
IC50
5.00±n/a nM
Citation
 Hert, JHunziker, DMattei, PRudolph, MSchmitz, PDi Giorgio, P Bicyclic compounds as ATX inhibitors US Patent  US10882857 Publication Date 1/5/2021 
Target
Name:
Ectonucleotide pyrophosphatase/phosphodiesterase family member 2
Synonyms:
ATX Autotaxin (ATX) ENPP2 Ectonucleotide Pyrophosphatase/Phosphodiesterase 2 (ENPP2) Extracellular lysophospholipase D PDNP2
Type:
Enzyme
Mol. Mass.:
99007.13
Organism:
Homo sapiens (Human)
Description:
Q13822
Residue:
863
  
Inhibitor
Name:
BDBM477059
Synonyms:
US10882857, Example 3 [2-Cyclopropyl-6-(oxan-4-ylmethoxy)pyridin-4-yl]-[2-(3-hydroxy-5,7-dihydro-4H-[1,2]oxazolo[5,4-c]pyridine-6-carbonyl)-4,6-dihydropyrrolo[3,4-d][1,3]oxazol-5-yl]methanone
Type:
Small organic molecule
Emp. Form.:
C27H29N5O7
Mol. Mass.:
535.5485
SMILES:
Oc1noc2CN(CCc12)C(=O)c1nc2CN(Cc2o1)C(=O)c1cc(OCC2CCOCC2)nc(c1)C1CC1
: