Target
Ectonucleotide pyrophosphatase/phosphodiesterase family member 2
Ligand
BDBM477060
Substrate
Meas. Tech.
Enzyme Inhibition Assay
IC50
2.00±n/a nM
Citation
 Hert, JHunziker, DMattei, PRudolph, MSchmitz, PDi Giorgio, P Bicyclic compounds as ATX inhibitors US Patent  US10882857 Publication Date 1/5/2021 
Target
Name:
Ectonucleotide pyrophosphatase/phosphodiesterase family member 2
Synonyms:
ATX Autotaxin (ATX) ENPP2 Ectonucleotide Pyrophosphatase/Phosphodiesterase 2 (ENPP2) Extracellular lysophospholipase D PDNP2
Type:
Enzyme
Mol. Mass.:
99007.13
Organism:
Homo sapiens (Human)
Description:
Q13822
Residue:
863
  
Inhibitor
Name:
BDBM477060
Synonyms:
US10882857, Example 3.01 | US11673888, Example 3.01
Type:
Small organic molecule
Emp. Form.:
C26H33N5O6S2
Mol. Mass.:
575.7
SMILES:
NS(=O)(=O)C1CCN(CC1)C(=O)c1nc2CN(Cc2s1)C(=O)c1cc(OCC2CCOCC2)nc(c1)C1CC1
: