Target
Egl nine homolog 1
Ligand
BDBM477205
Substrate
Meas. Tech.
EGLN-1 Activity Assay
IC50
298±13.6 nM
Citation
 You, QZhang, XLei, YHu, TWu, XSun, HGuo, XXu, X Alkynyl pyridine prolyl hydroxylase inhibitor, and preparation method and medical use thereof US Patent  US10889546 Publication Date 1/12/2021 
Target
Name:
Egl nine homolog 1
Synonyms:
C1orf12 EGLN1_HUMAN Hypoxia-inducible factor prolyl hydroxylase 2 (HIF-PH2) Prolyl hydroxylase domain-containing protein 2 (PHD2)
Type:
Protein
Mol. Mass.:
46035.59
Organism:
Homo sapiens (Human)
Description:
Q9GZT9
Residue:
426
  
Inhibitor
Name:
BDBM477205
Synonyms:
US10889546, Example 14
Type:
Small organic molecule
Emp. Form.:
C17H14N2O4
Mol. Mass.:
310.3041
SMILES:
Cc1cccc(c1)C#Cc1cnc(C(=O)NCC(O)=O)c(O)c1
: