Target
Heat shock protein HSP 90-alpha
Ligand
BDBM50464552
Substrate
Meas. Tech.
Endonuclease Activity Assay
IC50
429±n/a nM
Citation
 Seo, YH Dihydroxybenzamide compound having HSP90 inhibitory activity or pharmaceutically acceptable salt thereof, and medical use thereof US Patent  US10889552 Publication Date 1/12/2021 
Target
Name:
Heat shock protein HSP 90-alpha
Synonyms:
HS90A_HUMAN HSP86 HSP90AA1 HSPCA Heat shock 86 kDa Heat shock protein HSP 90-alpha (HSP90) LAP-2 Lipopolysaccharide-associated protein 2 heat shock protein 90kDa alpha (cytosolic), class A member 1 isoform 2
Type:
Molecular Chaperone
Mol. Mass.:
84623.45
Organism:
Homo sapiens (Human)
Description:
P07900
Residue:
732
  
Inhibitor
Name:
BDBM50464552
Synonyms:
CHEMBL4291855 US10889552, Compound 14g
Type:
Small organic molecule
Emp. Form.:
C18H19Cl2NO6
Mol. Mass.:
416.253
SMILES:
COc1cc(CN(C)C(=O)c2cc(Cl)c(O)cc2O)c(Cl)c(OC)c1OC
: