Target
Muscarinic acetylcholine receptor M1/M2
Ligand
BDBM477495
Substrate
Meas. Tech.
Inhibition Effect
IC50
70.0±n/a nM
Citation
 Miyahara, SUeno, HHara, SOgino, Y Sulfonamide compound or salt thereof US Patent  US10889555 Publication Date 1/12/2021 
Target
Name:
Muscarinic acetylcholine receptor M1/M2
Synonyms:
Human RNR
Type:
Protein
Mol. Mass.:
Description:
Components:
This complex has 2 components.
Component 1
Name:
Muscarinic acetylcholine receptor M1
Synonyms:
ACM1_HUMAN Cholinergic receptor, muscarinic 1 | Cholinergic, muscarinic M1
Type:
Protein
Mol. Mass.:
51442.54
Organism:
Homo sapiens (Human)
Description:
P11229
Residue:
460
  
Component 2
Name:
Muscarinic acetylcholine receptor M2
Synonyms:
ACM2_HUMAN Cholinergic, muscarinic M2 Muscarinic acetylcholine receptor M2 and M5 | RecName: Full=Muscarinic acetylcholine receptor M2
Type:
GPCR
Mol. Mass.:
51730.61
Organism:
Homo sapiens (Human)
Description:
P08172
Residue:
466
  
Inhibitor
Name:
BDBM477495
Synonyms:
4-(2,2-difluoroethoxy)-2-(N-((1S,2R)-2-(6-fluoro-2,3- US11634395, Example 263
Type:
Small organic molecule
Emp. Form.:
C22H23F3N4O6S
Mol. Mass.:
528.501
SMILES:
C[C@@H]([C@H](NS(=O)(=O)c1cc(OCC(F)F)ccc1C(N)=O)c1n[nH]c(=O)o1)c1c(F)ccc(C)c1C
: